Discussion:
Processing 8a68268922de8d13c43efbe0599677d51773b46d failed
security tracker role
2018-01-25 00:47:52 UTC
Permalink
The error message was:

Traceback (most recent call last):
File "bin/update-db", line 40, in <module>
warnings = db.readBugs(cursor, 'data')
File "/srv/security-tracker.debian.org/website/security-tracker/lib/python/security_db.py", line 946, in readBugs
read_one(cls(path + name))
File "/srv/security-tracker.debian.org/website/security-tracker/lib/python/security_db.py", line 938, in read_one
do_parse(source)
File "/srv/security-tracker.debian.org/website/security-tracker/lib/python/security_db.py", line 891, in do_parse
for bug in source:
File "/srv/security-tracker.debian.org/website/security-tracker/lib/python/bugs.py", line 733, in __iter__
comments, notes=pkg_notes, xref=xref))
File "/srv/security-tracker.debian.org/website/security-tracker/lib/python/bugs.py", line 773, in finishBug
bug.mergeNotes()
File "/srv/security-tracker.debian.org/website/security-tracker/lib/python/bugs.py", line 281, in mergeNotes
notes[key].merge(n)
AttributeError: PackageNoteNoDSA instance has no attribute 'merge'
Makefile:21: recipe for target 'all' failed
make: *** [all] Error 1
security tracker role
2018-01-25 01:38:28 UTC
Permalink
The error message was:

Traceback (most recent call last):
File "bin/update-db", line 40, in <module>
warnings = db.readBugs(cursor, 'data')
File "/srv/security-tracker.debian.org/website/security-tracker/lib/python/security_db.py", line 946, in readBugs
read_one(cls(path + name))
File "/srv/security-tracker.debian.org/website/security-tracker/lib/python/security_db.py", line 938, in read_one
do_parse(source)
File "/srv/security-tracker.debian.org/website/security-tracker/lib/python/security_db.py", line 891, in do_parse
for bug in source:
File "/srv/security-tracker.debian.org/website/security-tracker/lib/python/bugs.py", line 733, in __iter__
comments, notes=pkg_notes, xref=xref))
File "/srv/security-tracker.debian.org/website/security-tracker/lib/python/bugs.py", line 773, in finishBug
bug.mergeNotes()
File "/srv/security-tracker.debian.org/website/security-tracker/lib/python/bugs.py", line 281, in mergeNotes
notes[key].merge(n)
AttributeError: PackageNoteNoDSA instance has no attribute 'merge'
Makefile:21: recipe for target 'all' failed
make: *** [all] Error 1

Loading...